RDF description of
primary topic: structure grumeleuse

structure grumeleuse
type: Concept
subject: Pedology @en
subject: Pédologie
definition: Type de structure pédique construite dans laquelle les agrégats sont très poreux, irréguliers et mamelonnés, et présentent un ensemble complexe de faces courbes dominantes et de faces planes à surfaces irrégulières. (Source : INRA)
in scheme: PLP
note: Cette structure est caractéristique des horizons de surface humifères, bien aérés, à forte activité biologique et notamment à forte activité de vers de terre. (Source : INRA)
preferred label: crumb structure @en
related: http://opendata.inrae.fr/PLP/916
top concept of: PLP