structure lamellaire
type: Concept
subject: Pedology @en
subject: Pédologie
definition: Type de structure pédique dont les agrégats à arêtes vives sont caractérisés par une orientation préférentielle horizontale et une épaisseur beaucoup plus faible que leur largeur. (Source : INRA)
in scheme: PLP
note: Une telle structure reflète souvent soit un tassement important, soit une superposition de minces apports successifs (par exemple une croûte de battance ou un dépôt d'atterrissement). (Source : INRA)
preferred label: platy structure @en
related: http://opendata.inrae.fr/PLP/909
top concept of: PLP

RDF description of
primary topic: structure lamellaire