structure particulaire
type: Concept
subject: Pedology @en
subject: Agronomie
subject: Pédologie
subject: Agronomy @en
definition: Structure sans agrégats (apédique) par suite d'un manque de cohésion des particules minérales entre elles. (Source : INRA)
in scheme: PLP
note: Le plus souvent, il s'agit de matériaux sableux ou graveleux, mais aussi quelquefois de sables limoneux ou de craie. (Source : INRA)
preferred label: single-grain structure @en
top concept of: PLP

RDF description of
primary topic: structure particulaire