structures fragmentaires
type: Concept
subject: Pedology @en
subject: Pédologie
definition: Types de structures pédiques dont les agrégats présentent des arêtes anguleuses. (Source : INRA)
in scheme: PLP
preferred label: fragmental structures @en
related: http://opendata.inrae.fr/PLP/23
top concept of: PLP

RDF description of
primary topic: structures fragmentaires