alluviation
type: Concept
subject: Pedology
subject: Agronomie @fr
subject: Pédologie @fr
subject: Agronomy
modified: 2020-07-03T10:06:33.884+02:00
alternative label: accretion
definition: Dépôt de matériaux terreux, résultant d'un épisode d'érosion en amont ou plus haut sur un versant, qui sont venus s'accumuler dans un point bas ou contre un obstacle (haie, chemin). (Source : INRA) @fr
in scheme: PLP
preferred label: atterrissement @fr
top concept of: PLP

RDF description of
primary topic: alluviation