RDF description of
primary topic: structures lithiques

structures lithiques
type: Concept
subject: Pedology @en
subject: Pédologie
alternative label: structures lithologiques
definition: Types de structures ou organisations observables dans certains horizons profonds, héritées directement des matériaux parentaux et plus ou moins résiduelles (schistosité, litage, filons). (Source : INRA)
in scheme: PLP
note: Les structures lithiques s'opposent aux structures pédologiques ou pédo-biologiques en agrégats. (Source : INRA)
preferred label: lithological structures @en
related: http://opendata.inrae.fr/PLP/916
related: http://opendata.inrae.fr/PLP/907
related: http://opendata.inrae.fr/PLP/678
top concept of: PLP