RDF description of
primary topic: subsaturé

subsaturé
type: Concept
subject: Pedology @en
subject: Pédologie
definition: Qualifie un horizon ou un solum dont le taux de saturation du complexe adsorbant est compris entre 80 et 95 % (Référentiel Pédologique). (Source : INRA)
in scheme: PLP
preferred label: subsaturated @en
top concept of: PLP