RDF description of
primary topic: substratum

substratum
type: Concept
subject: Pedology @en
subject: Pédologie
modified: 2020-08-27T15:06:20.192+02:00
alternative label: bedrock @en
definition: Roche sous-jacente dont on pense qu'elle n'est pas la roche-mère du solum étudié. (Source : INRA)
in scheme: PLP
note: Ce mot prend des significations très différentes selon qu'il est employé en botanique, en géologie, en pédologie, en microbiologie ou en horticulture. (Source : INRA)
preferred label: substrate @en
top concept of: PLP