Sulfatosols
type: Concept
subject: Pedology @en
subject: Pédologie
definition: Sols sulfatés-acides caractérisés par la présence d'un horizon sulfaté situé à moins de 50 cm de la surface (Référentiel Pédologique). (Source : INRA)
in scheme: PLP
related: http://opendata.inrae.fr/PLP/969
related: http://opendata.inrae.fr/PLP/593
related: http://opendata.inrae.fr/PLP/483
related: http://opendata.inrae.fr/PLP/883
related: http://opendata.inrae.fr/PLP/588
related: http://opendata.inrae.fr/PLP/189
related: http://opendata.inrae.fr/PLP/534
top concept of: PLP

RDF description of
primary topic: Sulfatosols