RDF description of
primary topic: surface spécifique

surface spécifique
type: Concept
subject: Mineralogy @en
subject: Minéralogie
definition: Surface totale des particules d'un échantillon rapportée à l'unité de poids (ou bien à l'unité de volume). (Source : INRA)
in scheme: PLP
note: Dans le cas des très petites particules minérales des sols, cette surface est considérable (on compte en m2/g). La surface totale est la somme des surfaces externes (d'autant plus grandes que les particules sont petites) auxquelles s'ajoutent d'éventuelles surfaces internes. (Source : INRA)
preferred label: specific surface @en
top concept of: PLP