RDF description of
primary topic: sieving

sieving
type: Concept
subject: Geology
subject: Pedology
subject: Géologie @fr
subject: Pédologie @fr
alternative label: screening
alternative label: sifting
definition: Technique de séparation de particules ou d'agglomérats selon leur grosseur. (Source : INRA) @fr
in scheme: PLP
note: Le tamisage, utilisé surtout pour les fractions comprises entre 50 µm et 5 mm, peut être effectué à sec ou sous courant d'eau, après destruction complète des agrégats (analyse granulométrique) ou non (émottage). (Source : INRA) @fr
preferred label: tamisage @fr
related: http://opendata.inrae.fr/PLP/323
related: http://opendata.inrae.fr/PLP/420
related: http://opendata.inrae.fr/PLP/421
top concept of: PLP