tarière
type: Concept
subject: Pedology @en
subject: Pédologie
alternative label: sonde
definition: Instrument métallique enfoncé verticalement dans le sol permettant d'opérer des prélèvements et de faire des observations sur de petites carottes. (Source : INRA)
in scheme: PLP
note: La présence de graviers et a fortiori de cailloux peut empêcher l'utilisation d'une tarière comme outil d'étude des couvertures pédologiques. (Source : INRA)
preferred label: auger @en
related: http://opendata.inrae.fr/PLP/887
top concept of: PLP

RDF description of
primary topic: tarière