tassement
type: Concept
subject: Pedology @en
subject: Agronomie
subject: Pédologie
subject: Agronomy @en
modified: 2020-08-27T15:04:40.303+02:00
alternative label: compactage
definition: Diminution du volume total de porosité d'un volume de sol ou d'un horizon dans son ensemble, agissant sur la macroporosité et/ou sur la porosité texturale. (Source : INRA)
in scheme: PLP
note: Le tassement s'opère verticalement et résulte soit de phénomènes pédogénétiques naturels très lents (décarbonatation, éluviation), soit d'actions humaines volontaires (roulage) ou involontaires (piétinement des animaux, charge excessive des tracteurs et des engins agricoles ou forestiers). Il entraîne une diminution de l'aération et du réservoir en eau et, en conséquence, des difficultés d'enracinement. (Source : INRA)
preferred label: compaction (settlement) @en
related: http://opendata.inrae.fr/PLP/738
related: http://opendata.inrae.fr/PLP/582
related: http://opendata.inrae.fr/PLP/741
top concept of: PLP

RDF description of
primary topic: tassement