RDF description of
primary topic: taux de fibres frottées

taux de fibres frottées
type: Concept
subject: Pedology @en
subject: Pédologie
definition: Détermination spécifique des histosols. (Source : INRA)
in scheme: PLP
note: Il est obtenu par pesée du refus sur tamis de 200 µm après tamisage à l'eau. Il est exprimé sous la forme d'une proportion pondérale sur échantillons séchés à 105 °C. Il permet de classer les horizons histiques en sapriques, mésiques et fibriques. (Source : INRA)
preferred label: disaggregated fibre concentration @en
related: http://opendata.inrae.fr/PLP/470
top concept of: PLP