RDF description of
primary topic: taux de saturation du complexe adsorbant

taux de saturation du complexe adsorbant
type: Concept
subject: Pedology @en
subject: Pédologie
modified: 2020-06-29T12:06:25.051+02:00
alternative label: base saturation @en
definition: Proportion des sites du complexe adsorbant effectivement occupés par les quatre cations échangeables alcalins et alcalinoterreux (Ca2+, Mg2+, K+, Na+) à un moment donné, pour un horizon de sol. (Source : INRA)
in scheme: PLP
note: Le taux de saturation est un précieux indicateur pédologique et agronomique quant à la richesse chimique du milieu, laquelle détermine l'activité biologique, la qualité de la structure, les réserves en éléments fertilisants, etc. (Source : INRA)
preferred label: basic cation saturation ratio @en
related: http://opendata.inrae.fr/PLP/776
related: http://opendata.inrae.fr/PLP/702
top concept of: PLP