RDF description of
primary topic: taxon

taxon
type: Concept
subject: Pedology @en
subject: Pédologie
alternative label: taxin
definition: Catégorie d'une classification, d'une taxonomie. (Source : INRA)
in scheme: PLP
preferred label: taxon (pl.taxa) @en
related: http://opendata.inrae.fr/PLP/271
top concept of: PLP