RDF description of
primary topic: tensiomètre

tensiomètre
type: Concept
subject: Pedology @en
subject: Agronomie
subject: Pédologie
subject: Agronomy @en
definition: Instrument de mesure in situ du potentiel matriciel de l'eau du sol en un point. (Source : INRA)
in scheme: PLP
note: Une pointe ou un petit godet en matière poreuse est enfoncé dans le sol et relié à un manomètre. Une série de tensiomètres enfoncés à différentes profondeurs permettent de tracer un profil de dessiccation et de procéder à des suivis au cours du temps, d'où la possibilité d'étudier le régime hydrique en période de sécheresse et de conduire une irrigation. (Source : INRA)
preferred label: tensiometer @en
related: http://opendata.inrae.fr/PLP/747
top concept of: PLP