terra fusca
type: Concept
subject: Pedology @en
subject: Pédologie
definition: Matériaux pédologiques argileux, non calcaires, bruns ou brun rougeâtre, recouvrant les calcaires durs dans plusieurs régions d'Europe sous climats continentaux. (Source : INRA)
in scheme: PLP
note: Ce seraient des sols polycycliques anciens, plus ou moins affectés par les dernières périodes glaciaires. L'emploi de ce terme est déconseillé. (Source : INRA)
top concept of: PLP

RDF description of
primary topic: terra fusca