RDF description of
primary topic: terreau

terreau
type: Concept
subject: Horticulture
alternative label: vegetable mould @en
definition: Matériau organique d'origine végétale arrivé à un stade avancé de décomposition, pouvant être utilisé seul ou en mélange avec de la terre ou un matériau inerte pour servir de milieu de semis ou de culture. (Source : INRA)
in scheme: PLP
preferred label: compost @en
related: http://opendata.inrae.fr/PLP/957
related: http://opendata.inrae.fr/PLP/958
related: http://opendata.inrae.fr/PLP/955
top concept of: PLP