RDF description of
primary topic: terre fine

terre fine
type: Concept
subject: Pedology @en
subject: Agronomie
subject: Pédologie
subject: Agronomy @en
definition: Ensemble des particules de diamètre inférieur à 2 mm d'un échantillon de sol. (Source : INRA)
in scheme: PLP
note: La terre fine est séparée des éléments grossiers lors de l'émottage par passage à travers une passoire à trous ronds de 2 mm. Elle est constituée le plus souvent de petits fragments d'agrégats. C'est sur la terre fine que sont réalisées toutes les analyses (granulométrie, fertilisants, éléments majeurs, éléments traces, complexe d'échange, etc.) et la plupart des tests. (Source : INRA)
preferred label: fine earth @en
related: http://opendata.inrae.fr/PLP/791
related: http://opendata.inrae.fr/PLP/121
related: http://opendata.inrae.fr/PLP/323
related: http://opendata.inrae.fr/PLP/753
related: http://opendata.inrae.fr/PLP/316
related: http://opendata.inrae.fr/PLP/603
related: http://opendata.inrae.fr/PLP/955
related: http://opendata.inrae.fr/PLP/259
top concept of: PLP