RDF description of
primary topic: test NaF

test NaF
type: Concept
subject: Pedology @en
subject: Pédologie
alternative label: test au fluorure de sodium
definition: Test permettant de détecter sur le terrain la présence d'allophanes. (Source : INRA)
in scheme: PLP
note: Le test consiste à déposer une pastille de terre humide sur un papier filtre imbibé d'une solution alcoolique neutre de phénol-phtaléine. On imprègne ensuite l'échantillon de sol par quelques gouttes d'une solution de fluorure de sodium (NaF). En présence d'allophanes, il se développe rapidement (moins de 40 secondes) une vive couleur rouge liée à l'apparition d'un pH supérieur à 9,5. En effet, les allophanes et gels aluminiques ont la propriété de réagir avec NaF pour former des fluoaluminates et de la soude, d'où une réaction fortement alcaline. (Source : INRA)
preferred label: sodium fluoride test @en
related: http://opendata.inrae.fr/PLP/56
related: http://opendata.inrae.fr/PLP/38
top concept of: PLP