RDF description of
primary topic: texture

texture
type: Concept
subject: Pedology @en
subject: Agronomie
subject: Pédologie
subject: Agronomy @en
definition: Appréciation globale des propriétés mécaniques d'un matériau pédologique portée grâce à des sensations tactiles (comme le pétrissage entre les doigts), exprimée sous la forme d'une dénomination et permettant, après étalonnement et en l'absence de toute analyse, une estimation de la composition granulométrique. (Source : INRA)
in scheme: PLP
note: La détermination de la texture permet d'attribuer au matériau (horizon, solum) le nom d'une classe texturale (exemple : limon léger, argile sableuse, sable argilo-limoneux, etc.). À chaque classe, correspondent plus ou moins étroitement des comportements (adhésivité, plasticité) et des propriétés (de rétention d'eau, de porosité) ou des aptitudes (à la fissuration, au tassement, à la formation de croûtes de battance). (Source : INRA)
preferred label: soil texture @en
related: http://opendata.inrae.fr/PLP/915
related: http://opendata.inrae.fr/PLP/191
top concept of: PLP