RDF description of
primary topic: thixotropie

thixotropie
type: Concept
subject: Pedology @en
subject: Pédologie
definition: Propriété réversible d'un matériau très humide dont la consistance passe brusquement d'un état plutôt rigide et résistant à un état très fluide sous une forte pression (des doigts, du poids du corps). (Source : INRA)
in scheme: PLP
note: Certains andosols présentent cette propriété (Silandosols Perhydriques et Aluandosols Perhydriques) ainsi que certaines vases marines. (Source : INRA)
preferred label: thixotropy @en
top concept of: PLP