RDF description of
primary topic: Topovertisols

Topovertisols
type: Concept
subject: Pedology @en
subject: Pédologie
definition: Vertisols situés en position de bas-fonds (plaines alluviales, dépressions karstiques, cuvettes dans un micro-relief gilgaï, etc.) dont le pédoclimat est plus humide que le climat général (Référentiel Pédologique). (Source : INRA)
in scheme: PLP
note: Les Topovertisols existent sous des climats chauds à saisons contrastées. Pendant la saison humide des altérations interviennent, puis les ions libérés se concentrent à la saison sèche et participent à la néoformation de smectites. (Source : INRA)
related: http://opendata.inrae.fr/PLP/1001
related: http://opendata.inrae.fr/PLP/564
top concept of: PLP