RDF description of
primary topic: tourbière

tourbière
type: Concept
subject: Geology @en
subject: Pedology @en
subject: Géologie
subject: Pédologie
definition: Lieu où se forme la tourbe et où on l'exploite. (Source : INRA)
in scheme: PLP
note: Les tourbières basses sont des tourbières de vallées à hypnacées (mousses) dont l'existence est surtout liée à la topographie (tourbières topogènes), tandis que les tourbières hautes sont des tourbières à sphaignes, leur existence est plutôt liée aux conditions climatiques (tourbières ombrogènes). (Source : INRA)
preferred label: peat bog @en
top concept of: PLP