transect
type: Concept
subject: Pedology @en
subject: Phytosociology @en
subject: Phytosociologie
subject: Pédologie
definition: Série d'observations, de relevés floristiques, de sondages pédologiques ou de fosses organisés selon une ligne droite et espacés plus ou moins régulièrement. (Source : INRA)
in scheme: PLP
note: Dans le cas de l'étude d'un versant, le transect est orienté selon la plus grande pente. (Source : INRA)
related: http://opendata.inrae.fr/PLP/973
top concept of: PLP

RDF description of
primary topic: transect