RDF description of
primary topic: triangle de texture

triangle de texture
type: Concept
subject: Pedology @en
subject: Agronomie
subject: Pédologie
subject: Agronomy @en
definition: Diagramme permettant de présenter les résultats de l'analyse granulométrique. (Source : INRA)
in scheme: PLP
note: Les compositions granulométriques sont réduites à trois fractions (argiles, limons totaux, sables totaux) exprimées de façon que leur somme fasse 100 %. Chaque diagramme est divisé en un nombre variable de classes devant correspondre à des textures, donc à des comportements différents. Il en existe de nombreux modèles mais le principe en est toujours le même, que le triangle soit équilatéral ou rectangle : on positionne la composition granulométrique selon deux des trois fractions (la troisième, égale au complément à 100 %, n'est plus libre). Il existe un grand nombre de diagrammes dans le monde dont ni les dénominations, ni les limites de classes ne sont identiques. On peut citer le diagramme USDA (12 classes), le diagramme de la carte mondiale des sols FAO-UNESCO (3 classes), le diagramme belge (7 classes), ainsi que les triangles anglais (11 classes), suisse (10 classes), néerlandais (10 classes), ISSS (12 classes), etc. En France, les deux triangles utilisés sont ceux du Service de la carte des sols de l'Aisne (équilatéral) et celui du GEPPA (isocèle rectangle). (Source : INRA)
preferred label: texture triangle @en
related: http://opendata.inrae.fr/PLP/80
related: http://opendata.inrae.fr/PLP/394
related: http://opendata.inrae.fr/PLP/421
related: http://opendata.inrae.fr/PLP/191
top concept of: PLP