RDF description of
primary topic: earthworm casts

earthworm casts
type: Concept
subject: Pedology
subject: Pédologie @fr
alternative label: earthworm piles
definition: Déjections de vers de terre anéciques, enroulées en amas et formant de petits reliefs à la surface de certains sols, sous forêts ou prairies. (Source : INRA) @fr
in scheme: PLP
preferred label: turricules @fr
related: http://opendata.inrae.fr/PLP/634
related: http://opendata.inrae.fr/PLP/999
top concept of: PLP