typologie de sols
type: Concept
subject: Pedology @en
subject: Pédologie
definition: Typologie de solums élaborée pour un territoire plus ou moins grand. (Source : INRA)
in scheme: PLP
note: Il n'est pas possible d'établir une typologie de sols au sens d'individus-sols. L'étude de sondages à la tarière ou l'examen de fosses ne sont que des observations ponctuelles permettant d'échantillonner et d'acquérir une connaissance discrète et localisée relative aux couvertures pédologiques. À partir des données disponibles (morphologiques, analytiques), on s'efforce de distinguer des catégories judicieuses sur la base de critères jugés pertinents et/ou discriminants dans le contexte de l'étude (milieu naturel, thématique). À la différence de nombreuses classifications, une typologie n'implique pas nécessairement de hiérarchie. Des méthodes mathématiques de classification par " ressemblance " peuvent aider à l'élaboration de typologies " objectives " mais l'on reste alors totalement dépendant des variables (quantitatives ou qualitatives) utilisées. (Source : INRA)
preferred label: soil typology @en
related: http://opendata.inrae.fr/PLP/989
related: http://opendata.inrae.fr/PLP/192
related: http://opendata.inrae.fr/PLP/680
related: http://opendata.inrae.fr/PLP/771
related: http://opendata.inrae.fr/PLP/993
related: http://opendata.inrae.fr/PLP/885
related: http://opendata.inrae.fr/PLP/788
related: http://opendata.inrae.fr/PLP/259
top concept of: PLP

RDF description of
primary topic: typologie de sols