RDF description of
primary topic: unité typologique de sol

unité typologique de sol
type: Concept
subject: Pedology @en
subject: Pédologie
alternative label: UTS
definition: Catégorie d'une typologie de sols. (Source : INRA)
in scheme: PLP
note: Les unités typologiques sont distinguées en prenant en compte l'aspect et les propriétés de solums effectivement étudiés, sans aucune référence à une localisation, ni à une extension spatiale. Leur définition est donc indépendante de l'échelle graphique de publication d'une carte. Pratiquement synonyme de type de sol. (Source : INRA)
preferred label: typological soil unit @en
related: http://opendata.inrae.fr/PLP/989
related: http://opendata.inrae.fr/PLP/192
related: http://opendata.inrae.fr/PLP/87
related: http://opendata.inrae.fr/PLP/990
related: http://opendata.inrae.fr/PLP/992
related: http://opendata.inrae.fr/PLP/788
related: http://opendata.inrae.fr/PLP/789
related: http://opendata.inrae.fr/PLP/259
top concept of: PLP