RDF description of
primary topic: valeur indicative

valeur indicative
type: Concept
subject: Pedology @en
subject: Pédologie
subject: Environment @en
subject: Environnement
alternative label: valeur de référence
definition: Valeur de concentration en une substance potentiellement toxique, ou en un élément polluant, définie par une réglementation et servant de seuil au-delà duquel la fertilité du sol étudié n'est plus garantie à long terme. (Source : INRA)
in scheme: PLP
note: Ce n'est pas un seuil de pollution. La fixation de telles valeurs pour chaque élément ou substance potentiellement polluants est particulièrement délicate. La principale critique que l'on peut faire à ce type de valeur réglementaire est d'être unique et de devoir être appliquée à la large variété des sols, d'autant plus large que le territoire concerné est plus grand et plus varié au plan géologique. (Source : INRA)
preferred label: reference value @en
related: http://opendata.inrae.fr/PLP/850
related: http://opendata.inrae.fr/PLP/995
top concept of: PLP