RDF description of
primary topic: valeur d'intervention

valeur d'intervention
type: Concept
subject: Pedology @en
subject: Pédologie
subject: Environment @en
subject: Environnement
alternative label: valeur d'assainissement
definition: Valeur de concentration en une substance potentiellement toxique ou en un élément polluant dans un volume de sol, définie par une réglementation et servant de seuil au-delà duquel une intervention ou un assainissement est obligatoire. (Source : INRA)
in scheme: PLP
note: Ces valeurs sont souvent modulées en fonction de l'utilisation effective ou potentielle du terrain considéré. L'intervention peut se limiter à l'interdiction de telle ou telle utilisation (cultures alimentaires, place de jeux). L'assainissement implique d'obtenir une diminution notable du danger. (Source : INRA)
preferred label: remediation value @en
related: http://opendata.inrae.fr/PLP/850
related: http://opendata.inrae.fr/PLP/994
top concept of: PLP