RDF description of
primary topic: vermiculites

vermiculites
type: Concept
subject: Mineralogy @en
subject: Pedology @en
subject: Minéralogie
subject: Pédologie
definition: Groupe de minéraux argileux 2/1 trioctaédriques à charges interfoliaires comprises entre 0,6 et 0,9. (Source : INRA)
in scheme: PLP
note: L'épaisseur des feuillets est de 10 angströms mais les espaces interfoliaires de ces minéraux chargés peuvent être occupés soit par des cations secs comme K, soit par des cations plus hydratés comme Na, Mg ou Ca, plus rarement par des cations hydroxylés Al ou Fe. L'épaisseur de ces espaces interfoliaires pourra varier largement en fonction de la nature des cations interfoliaires et de leur degré d'hydratation. Ces minéraux expansibles proviennent principalement de la transformation des micas (biotites) ou des illites. Ils présentent une forte capacité d'échange : 100 à 150 cmol/kg. En sols très acides (pH inférieur à 5) il peut y avoir formation progressive de vermiculites hydroxyalumineuses (dites parfois pseudochlorites ou chlorites secondaires) dans lesquelles une couche discontinue d'aluminium interfoliaire empêche la fermeture des feuillets lors de tests de chauffage au laboratoire et bloque les capacités de gonflement. (Source : INRA)
related: http://opendata.inrae.fr/PLP/615
top concept of: PLP