RDF description of C1124
primary topic: rosbif

rosbif
type: Concept
type: NamedIndividual
broader: C1448
definition: Terme réservé au rôti de bœuf. Pour aller plus loin: avouons aussi que «les Rosbifs» désignent pour les Français, de façon affectueuse le plus souvent, mais parfois un peu moins, les sujets de sa Gracieuse Majesté. Les rosbifs et les frogs, vieille et rude fraternité…
in scheme: ThesaurusViande
related: C1117