civet
type: Concept
type: NamedIndividual
broader: C1453
definition: Préparation culinaire à base de viande de gibier à poil : lièvre, marcassin, lapin de garenne, chevreuil. Le civet est un ragoût où la viande cuit dans du vin rouge avec lardons, oignons, champignons ; la sauce est liée en fin de cuisson avec le sang de l’animal (éventuellement remplacé par du sang de porc) lui conférant onctuosité et coloration.
in scheme: ThesaurusViande
related: C1351

RDF description of C124
primary topic: civet