teriyaki
type: Concept
type: NamedIndividual
broader: C1474
definition: Mode de cuisson japonaise consistant à arroser régulièrement une volaille, une viande voire un poisson lors de leur cuisson au grill ou poêlée, avec un mélange de sauce soja et de mirin, de saké, de sucre et de gingembre râpé dite sauce « teriyaki ».
in scheme: ThesaurusViande

RDF description of C191
primary topic: teriyaki