RDF description of C259
primary topic: Orloff

Orloff
type: Concept
type: NamedIndividual
broader: C1449
definition: Préparation culinaire créée par Urbain Dubois, cuisinier du Prince Orloff au XIXe siècle. Il s’agit d’un filet de veau enveloppé de minces bardes de lard, braisé et accompagné de purée Soubise, de truffes et de sauce Mornay. Aujourd’hui, l’appellation orloff concerne des rôtis de veau mais aussi de porc, dont les tranches pré-coupées sont intercalées de bacon et de fromage type cheddar.
in scheme: ThesaurusViande