RDF description of C302
primary topic: étouffée (cuire à l')

étouffée (cuire à l')
type: Concept
type: NamedIndividual
broader: C1474
definition: Mode de cuisson des aliments dans un récipient hermétiquement clos avec très peu de liquide et de matière grasse.
in scheme: ThesaurusViande