RDF description of C340
primary topic: chevreuil

chevreuil
type: Concept
type: NamedIndividual
broader: C910
definition: Capreolus capreolus, le chevreuil est un cervidé. En français canadien, le mot chevreuil peut désigner aussi le cerf de Virginie. Le mâle est le brocard, la femelle la chevrette. Le jeune est le faon, puis le chevrillard et le daguet. La viande de chevreuil est maigre (5% de gras) et riche en fer. La cuire rosée.
in scheme: ThesaurusViande
related: C1351
related: C673