matière stercoraire
type: Concept
type: NamedIndividual
broader: C461
definition: Sous-produit de l’abattage des animaux : contenu de l’appareil digestif des animaux. Les matières stercoraires sont aujourd’hui le plus souvent utilisées dans la fabrication de compost.
in scheme: ThesaurusViande

RDF description of C341
primary topic: matière stercoraire