RDF description of C359
primary topic: krakkauer

krakkauer
type: Concept
type: NamedIndividual
broader: C901
definition: Salami cuit originaire d’Europe de l’Est. Son enveloppe extérieure est brunie par un fumage très poussé.
in scheme: ThesaurusViande
related: C1316