RDF description of C385
primary topic: trait (animal de)

trait (animal de)
type: Concept
type: NamedIndividual
broader: C1013
definition: Qualifie les animaux (bovins ou chevaux) utilisés pour tirer des charrues, charrettes et autres attelages.
in scheme: ThesaurusViande