museau
type: Concept
type: NamedIndividual
broader: C1147
definition: Produit tripier. Partie avant de la tête d’animaux de boucherie, bœuf et porc essentiellement.
in scheme: ThesaurusViande

RDF description of C38
primary topic: museau