bestiau
type: Concept
type: NamedIndividual
broader: C1314
definition: Au singulier, bestiau désigne un animal quelconque, un brin péjoratif. Peu usité au singulier, son pluriel est synonyme et s’emploie souvent à la place de bétail : un commerçant de bétail ou un commerçant en bestiaux.
in scheme: ThesaurusViande
related: C554

RDF description of C404
primary topic: bestiau