cuisson basse température
type: Concept
type: NamedIndividual
broader: C1474
definition: Ce procédé a pour avantage de conserver la saveur, la jutosité et d’attendrir les viandes ; la température de cuisson est inférieure à 70°C. C’est une technique qui requiert une formation, un savoir-faire confirmé et un équipement adapté hors de portée de la cuisine ménagère. Les premiers essais ont été faits dans les années quatre-vingt, puis cette technique fut divulguée par les centres de formation, les ouvrages et les grandes toques de la cuisine. Elle est aujourd’hui parfaitement maîtrisée et couramment pratiquée dans les cuisines et les ateliers industriels.
in scheme: ThesaurusViande
related: C430

RDF description of C480
primary topic: cuisson basse température