gouge
type: Concept
type: NamedIndividual
broader: C1367
definition: Outil du charcutier. Couteau de forme incurvée qui épouse la forme de l’os ; il est utilisé pour enlever le fémur du jambon sans l’ouvrir.
in scheme: ThesaurusViande

RDF description of C490
primary topic: gouge