RDF description of C495
primary topic: obturateur

obturateur
type: Concept
type: NamedIndividual
broader: C504
definition: Autre nom donné aux deux muscles interne et externe qui tapissent le trou coxal du bassin d’un bœuf, de forme irrégulière aussi dénommés araignée et fausse araignée.
in scheme: ThesaurusViande
related: C504
related: C119