raser
type: Concept
type: NamedIndividual
broader: C700
definition: Couper le poil d’un bovin à l’aide d’une tondeuse, sur tout ou partie du corps, afin de faire ressortir les masses musculaires. Cette préparation est effectuée le plus souvent en vue d’une présentation à un concours.
in scheme: ThesaurusViande
narrower: C211

RDF description of C516
primary topic: raser