RDF description of C520
primary topic: capucin

capucin
type: Concept
type: NamedIndividual
broader: C240
definition: Lièvre âgé de plus d’un an le plus souvent cuisiné en civet.
in scheme: ThesaurusViande