RDF description of C573
primary topic: lustrer

lustrer
type: Concept
type: NamedIndividual
broader: C138
definition: Donner du brillant à une préparation en enduisant sa surface de beurre clarifiée ou d’une gelée.
in scheme: ThesaurusViande